{"text_format":"1","workbook":"xlsx","n_sheets":12,"sheets":["Data Source","BS 2014","BS 2015","BS 2016","Exercise -->","1.1","P&L","BS","FA Roll Forward PPE","Financial Liabilities","Equity Schedule","Cash Flow"],"not_rendered":{"charts":0,"images":0,"macros":1,"external_links":0,"defined_names":2,"comments":0,"pivot_tables":0},"unopened":[],"bounds":{"document_bytes":16777216,"sheet_cells":100000,"rows_first":2000,"rows_last":500,"rows_between":2000,"halvings":0,"cell_chars":16384,"cell_head_chars":4096},"cells_cut":0,"cells_raw":0,"read":"whole","date_system":"1900"}

{"sheet":"Data Source","index":0,"n_rows":438,"n_cols":4,"rows_kept":438,"cut":false,"hidden":true,"merged":[]}
[]
[]
[null,"Date","Financials","Amount"]
[null,"1.1.2014","Revenue - Supermarkets",72]
[null,"1.1.2014","Cogs - Supermarkets",47]
[null,"1.1.2014","Revenue - Discounters",37]
[null,"1.1.2014","Cogs - Discounters",20]
[null,"1.1.2014","Revenue - Grocery",36]
[null,"1.1.2014","Cogs - Grocery",17]
[null,"1.1.2014","Revenue - Retail",57]
[null,"1.1.2014","Cogs - Retail",32]
[null,"1.1.2014","Operating expenses",95.399999999999991]
[null,"1.1.2014","D&A",2]
[null,"1.1.2014","Interest expenses",5]
[null,"1.1.2014","Taxes",17.29]
{"$rows_left_out":424}
{"sheet":"BS 2014","index":1,"n_rows":55,"n_cols":3,"rows_kept":55,"cut":false,"hidden":true,"merged":[]}
["$ in mln",null,"2014-12-31"]
["Receivables - Discounters",null,44.609000000000002]
["Receivables - Other",null,33.097000000000001]
["Receivables - Grocery",null,31.658000000000001]
["Receivables - Retail",null,20.146000000000004]
["Receivables - Supermarkets",null,14.39]
["Trade Receivables",null,143.9]
[]
["Inventory - Discounters",null,29.749999999999996]
["Inventory - Supermarkets",null,18.7]
["Inventory - Grocery",null,16.149999999999999]
["Inventory - Retail",null,11.05]
["Inventory - Other",null,9.35]
["Inventory",null,84.999999999999986]
[]
{"$rows_left_out":41}
{"sheet":"BS 2015","index":2,"n_rows":55,"n_cols":3,"rows_kept":55,"cut":false,"hidden":true,"merged":[]}
["$ in mln","Code I","2015-12-31"]
["Receivables - Discounters","R",40.248000000000005]
["Receivables - Grocery","R",34.056000000000004]
["Receivables - Other","R",29.412000000000003]
["Receivables - Retail","R",27.864000000000001]
["Receivables - Supermarkets","R",23.220000000000002]
["Trade Receivables",null,154.80000000000001]
[]
["Inventory - Discounters","I",24.840000000000003]
["Inventory - Supermarkets","I",20.239999999999998]
["Inventory - Grocery","I",17.48]
["Inventory - Other","I",17.48]
["Inventory - Retail","I",11.96]
["Inventory","I",92.000000000000014]
[]
{"$rows_left_out":41}
{"sheet":"BS 2016","index":3,"n_rows":55,"n_cols":4,"rows_kept":55,"cut":false,"hidden":true,"merged":[]}
["$ in mln","Code I","Code II","2016-12-31"]
["Receivables - Discounters","R","A",44.018000000000008]
["Receivables - Grocery","R","A",40.631999999999998]
["Receivables - Other","R","A",32.167000000000002]
["Receivables - Retail","R","A",27.088000000000001]
["Receivables - Supermarkets","R","A",25.395]
["Trade Receivables",null,null,169.3]
[]
["Inventory - Discounters","I","A",26.4]
["Inventory - Supermarkets","I","A",25.3]
["Inventory - Grocery","I","A",20.9]
["Inventory - Other","I","A",20.9]
["Inventory - Retail","I","A",16.5]
["Inventory","I",null,110]
[]
{"$rows_left_out":41}
{"sheet":"Exercise -->","index":4,"n_rows":13,"n_cols":2,"rows_kept":13,"cut":false,"hidden":true,"merged":[]}
[]
[]
[]
[]
[]
[]
[]
[]
[]
[]
[]
[]
[null,"Exercise -->"]

{"sheet":"1.1","index":5,"n_rows":438,"n_cols":6,"rows_kept":438,"cut":false,"hidden":true,"merged":[]}
[]
[]
[null,"Date","Year","Financials","Amount","Mapping"]
[null,"2014-01-01",{"$f":"YEAR(B4)","v":2014},"Revenue - Supermarkets",72,"Revenue"]
[null,"2014-01-01",{"$f":"YEAR(B5)","v":2014},"Cogs - Supermarkets",47,"Cogs"]
[null,"2014-01-01",2014,"Revenue - Discounters",37,"Revenue"]
[null,"2014-01-01",2014,"Cogs - Discounters",20,"Cogs"]
[null,"2014-01-01",2014,"Revenue - Grocery",36,"Revenue"]
[null,"2014-01-01",2014,"Cogs - Grocery",17,"Cogs"]
[null,"2014-01-01",2014,"Revenue - Retail",57,"Revenue"]
[null,"2014-01-01",2014,"Cogs - Retail",32,"Cogs"]
[null,"2014-01-01",2014,"Operating expenses",95.399999999999991,"Operating expenses"]
[null,"2014-01-01",2014,"D&A",2,"D&A"]
[null,"2014-01-01",2014,"Interest expenses",5,"Interest"]
[null,"2014-01-01",2014,"Taxes",17.29,"Taxes"]
{"$rows_left_out":424}
{"sheet":"P&L","index":6,"n_rows":37,"n_cols":14,"rows_kept":37,"cut":false,"hidden":false,"merged":[]}
[null,"P&L"]
[]
[null,"Scenario:","Base Case"]
[null,null,null,null,null,null,null,null,null,"Forecast"]
[null,"$  in MM",2014,2015,2016,null,"Var %\n14-15","Var %\n15-16",null,{"$f":"E5+1","v":2017},{"$f":"J5+1","v":2018},{"$f":"K5+1","v":2019},2020,2021]
[null,"Revenue",{"$f":"SUMIFS('1.1'!$E:$E,'1.1'!$C:$C,'P&L'!C$5,'1.1'!$F:$F,'P&L'!$B6)","v":2922},{"$f":"SUMIFS('1.1'!$E:$E,'1.1'!$C:$C,'P&L'!D$5,'1.1'!$F:$F,'P&L'!$B6)","v":2984},{"$f":"SUMIFS('1.1'!$E:$E,'1.1'!$C:$C,'P&L'!E$5,'1.1'!$F:$F,'P&L'!$B6)","v":3040},null,{"$f":"D6/C6-1","v":2.1218343600273748E-2},{"$f":"E6/D6-1","v":1.8766756032171594E-2},null,{"$f":"E6*(1+J20)","v":3100.8},{"$f":"J6*(1+K20)","v":3162.8160000000003},{"$f":"K6*(1+L20)","v":3226.0723200000002},3290.5937664000003,3356.4056417280003]
[null,"Cogs",{"$f":"-SUMIFS('1.1'!$E:$E,'1.1'!$C:$C,'P&L'!C$5,'1.1'!$F:$F,'P&L'!$B7)","v":-1401},{"$f":"-SUMIFS('1.1'!$E:$E,'1.1'!$C:$C,'P&L'!D$5,'1.1'!$F:$F,'P&L'!$B7)","v":-1383},{"$f":"-SUMIFS('1.1'!$E:$E,'1.1'!$C:$C,'P&L'!E$5,'1.1'!$F:$F,'P&L'!$B7)","v":-1367},null,{"$f":"D7/C7-1","v":-1.2847965738758016E-2},{"$f":"E7/D7-1","v":-1.156905278380338E-2},null,{"$f":"J6*J26","v":-1439.4006847195997},{"$f":"K6*K26","v":-1468.1886984139917},-1497.5524723822714,-1527.503521829917,-1558.0535922665154]
[null,"Gross Profit",{"$f":"SUM(C6:C7)","v":1521},{"$f":"SUM(D6:D7)","v":1601},1673,null,5.2596975673898649E-2,4.4971892567145622E-2,null,{"$f":"SUM(J6:J7)","v":1661.3993152804005},{"$f":"SUM(K6:K7)","v":1694.6273015860086},{"$f":"SUM(L6:L7)","v":1728.5198476177288},{"$f":"SUM(M6:M7)","v":1763.0902445700833},{"$f":"SUM(N6:N7)","v":1798.352049461485}]
[null,"Operating Expenses",{"$f":"-SUMIFS('1.1'!$E:$E,'1.1'!$C:$C,'P&L'!C$5,'1.1'!$F:$F,'P&L'!$B9)","v":-1212.1799999999998},{"$f":"-SUMIFS('1.1'!$E:$E,'1.1'!$C:$C,'P&L'!D$5,'1.1'!$F:$F,'P&L'!$B9)","v":-1245.3399999999999},{"$f":"-SUMIFS('1.1'!$E:$E,'1.1'!$C:$C,'P&L'!E$5,'1.1'!$F:$F,'P&L'!$B9)","v":-1068.24},null,2.7355673249847445E-2,-0.14221015947452098,null,{"$f":"J6*J32","v":-1223.3481586206517},{"$f":"K6*K32","v":-1247.8151217930647},-1272.771424228926,-1298.2268527135045,{"$f":"N6*N32","v":-1324.1913897677748}]
[null,"EBITDA",{"$f":"SUM(C8:C9)","v":308.82000000000016},{"$f":"SUM(D8:D9)","v":355.66000000000008},604.76,null,0.15167411437083045,0.70038801102176196,null,{"$f":"SUM(J8:J9)","v":438.05115665974881},{"$f":"SUM(K8:K9)","v":446.81217979294388},{"$f":"SUM(L8:L9)","v":455.74842338880285},{"$f":"SUM(M8:M9)","v":464.8633918565788},{"$f":"SUM(N8:N9)","v":474.16065969371016}]
[null,"D&A",{"$f":"-SUMIFS('1.1'!$E:$E,'1.1'!$C:$C,'P&L'!C$5,'1.1'!$F:$F,'P&L'!$B11)","v":-31},{"$f":"-SUMIFS('1.1'!$E:$E,'1.1'!$C:$C,'P&L'!D$5,'1.1'!$F:$F,'P&L'!$B11)","v":-44},{"$f":"-SUMIFS('1.1'!$E:$E,'1.1'!$C:$C,'P&L'!E$5,'1.1'!$F:$F,'P&L'!$B11)","v":-41},null,0.41935483870967749,-6.8181818181818232E-2,null,{"$f":"'FA Roll Forward PPE'!F6","v":-44.314229249011859},{"$f":"'FA Roll Forward PPE'!G6","v":-45.260066553140966},{"$f":"'FA Roll Forward PPE'!H6","v":-46.22609168905781},{"$f":"'FA Roll Forward PPE'!I6","v":-47.212735543290663},{"$f":"'FA Roll Forward PPE'!J6","v":-48.22043819915536}]
[null,"EBIT",{"$f":"SUM(C10:C11)","v":277.82000000000016},{"$f":"SUM(D10:D11)","v":311.66000000000008},563.76,null,0.12180548556619364,0.80889430789963379,null,{"$f":"SUM(J10:J11)","v":393.73692741073694},{"$f":"SUM(K10:K11)","v":401.55211323980291},{"$f":"SUM(L10:L11)","v":409.52233169974505},{"$f":"SUM(M10:M11)","v":417.65065631328815},{"$f":"SUM(N10:N11)","v":425.94022149455481}]
[null,"Interest",{"$f":"-SUMIFS('1.1'!$E:$E,'1.1'!$C:$C,'P&L'!C$5,'1.1'!$F:$F,'P&L'!$B13)","v":-56},{"$f":"-SUMIFS('1.1'!$E:$E,'1.1'!$C:$C,'P&L'!D$5,'1.1'!$F:$F,'P&L'!$B13)","v":-65},{"$f":"-SUMIFS('1.1'!$E:$E,'1.1'!$C:$C,'P&L'!E$5,'1.1'!$F:$F,'P&L'!$B13)","v":-52},null,0.16071428571428581,-0.19999999999999996,null,{"$f":"'Financial Liabilities'!C17","v":-54.449999999999996},{"$f":"'Financial Liabilities'!D17","v":-50.866096104453099},{"$f":"'Financial Liabilities'!E17","v":-46.959640858306997},{"$f":"'Financial Liabilities'!F17","v":-42.701604640007737},{"$f":"'Financial Liabilities'!G17","v":-38.060345162061552}]
[null,"EBT",{"$f":"SUM(C12:C13)","v":221.82000000000016},{"$f":"SUM(D12:D13)","v":246.66000000000008},511.76,null,0.11198268866648586,1.0747587772642495,null,{"$f":"SUM(J12:J13)","v":339.28692741073695},{"$f":"SUM(K12:K13)","v":350.6860171353498},{"$f":"SUM(L12:L13)","v":362.56269084143804},{"$f":"SUM(M12:M13)","v":374.94905167328039},{"$f":"SUM(N12:N13)","v":387.87987633249327}]
[null,"Taxes",{"$f":"-SUMIFS('1.1'!$E:$E,'1.1'!$C:$C,'P&L'!C$5,'1.1'!$F:$F,'P&L'!$B15)","v":-207.52},{"$f":"-SUMIFS('1.1'!$E:$E,'1.1'!$C:$C,'P&L'!D$5,'1.1'!$F:$F,'P&L'!$B15)","v":-209.98},{"$f":"-SUMIFS('1.1'!$E:$E,'1.1'!$C:$C,'P&L'!E$5,'1.1'!$F:$F,'P&L'!$B15)","v":-208.57999999999998},null,1.1854279105628196E-2,-6.6673016477759584E-3,null,{"$f":"J14*$J37","v":-118.75042459375793},{"$f":"K14*$J37","v":-122.74010599737242},-126.89694179450331,-131.23216808564814,-135.75795671637263]
{"$rows_left_out":23}
{"sheet":"BS","index":7,"n_rows":27,"n_cols":11,"rows_kept":27,"cut":false,"hidden":false,"merged":[[2,5,2,9]]}
[null,"Balance Sheet"]
[]
[null,null,null,null,null,"Forecast"]
[null,"$ in MM","2014-12-31","2015-12-31","2016-12-31","2017-12-31","2018-12-31","2019-12-31","2020-12-31","2021-12-31"]
[null,"Trade Receivables",{"$f":"OFFSET('BS 2014'!$A$1,MATCH(BS!B5,'BS 2014'!$A:$A,0)-1,MATCH(BS!C$4,'BS 2014'!$1:$1,0)-1)","v":143.9},{"$f":"INDEX('BS 2015'!$1:$1048576,MATCH(BS!$B5,'BS 2015'!$A:$A,0),MATCH(BS!D$4,'BS 2015'!$1:$1,0))","v":154.80000000000001},{"$f":"INDEX('BS 2016'!$1:$1048576,MATCH(BS!$B5,'BS 2016'!$A:$A,0),MATCH(BS!E$4,'BS 2016'!$1:$1,0))","v":169.3},{"$f":"F19*'P&L'!J6/360","v":162.08352519575084},{"$f":"G19*'P&L'!K6/360","v":165.32519569966584},{"$f":"H19*'P&L'!L6/360","v":168.63169961365915},{"$f":"I19*'P&L'!M6/360","v":172.00433360593235},{"$f":"J19*'P&L'!N6/360","v":175.44442027805098}]
[null,"Inventory",{"$f":"OFFSET('BS 2014'!$A$1,MATCH(BS!B6,'BS 2014'!$A:$A,0)-1,MATCH(BS!C$4,'BS 2014'!$1:$1,0)-1)","v":84.999999999999986},{"$f":"INDEX('BS 2015'!$1:$1048576,MATCH(BS!$B6,'BS 2015'!$A:$A,0),MATCH(BS!D$4,'BS 2015'!$1:$1,0))","v":92.000000000000014},{"$f":"INDEX('BS 2016'!$1:$1048576,MATCH(BS!$B6,'BS 2016'!$A:$A,0),MATCH(BS!E$4,'BS 2016'!$1:$1,0))","v":110},{"$f":"-F21*'P&L'!J$7/360","v":99.635882194775547},{"$f":"-G21*'P&L'!K$7/360","v":101.62859983867106},{"$f":"-H21*'P&L'!L$7/360","v":103.66117183544449},{"$f":"-I21*'P&L'!M$7/360","v":105.73439527215339},{"$f":"-J21*'P&L'!N$7/360","v":107.84908317759647}]
[null,"PP&E",{"$f":"OFFSET('BS 2014'!$A$1,MATCH(BS!B7,'BS 2014'!$A:$A,0)-1,MATCH(BS!C$4,'BS 2014'!$1:$1,0)-1)","v":632.5},{"$f":"INDEX('BS 2015'!$1:$1048576,MATCH(BS!$B7,'BS 2015'!$A:$A,0),MATCH(BS!D$4,'BS 2015'!$1:$1,0))","v":632.5},{"$f":"INDEX('BS 2016'!$1:$1048576,MATCH(BS!$B7,'BS 2016'!$A:$A,0),MATCH(BS!E$4,'BS 2016'!$1:$1,0))","v":659.5},{"$f":"'FA Roll Forward PPE'!F8","v":673.57628458498027},{"$f":"'FA Roll Forward PPE'!G8","v":687.95301160774272},{"$f":"'FA Roll Forward PPE'!H8","v":702.6365936736787},{"$f":"'FA Roll Forward PPE'!I8","v":717.63358025801801},{"$f":"'FA Roll Forward PPE'!J8","v":732.95066062716148},"FA Rollforward"]
[null,"Cash",{"$f":"OFFSET('BS 2014'!$A$1,MATCH(BS!B8,'BS 2014'!$A:$A,0)-1,MATCH(BS!C$4,'BS 2014'!$1:$1,0)-1)","v":24.8},{"$f":"INDEX('BS 2015'!$1:$1048576,MATCH(BS!$B8,'BS 2015'!$A:$A,0),MATCH(BS!D$4,'BS 2015'!$1:$1,0))","v":21.8},{"$f":"INDEX('BS 2016'!$1:$1048576,MATCH(BS!$B8,'BS 2016'!$A:$A,0),MATCH(BS!E$4,'BS 2016'!$1:$1,0))","v":220},{"$f":"E8+'Cash Flow'!C19","v":337.28732014032749},{"$f":"F8+'Cash Flow'!D19","v":412.2603386584409},{"$f":"G8+'Cash Flow'!E19","v":487.57169477558114},{"$f":"H8+'Cash Flow'!F19","v":563.06043092626862},{"$f":"I8+'Cash Flow'!G19","v":638.54733827804716},"Cash Flow "]
[null,"Other assets",{"$f":"OFFSET('BS 2014'!$A$1,MATCH(BS!B9,'BS 2014'!$A:$A,0)-1,MATCH(BS!C$4,'BS 2014'!$1:$1,0)-1)","v":45.9},{"$f":"INDEX('BS 2015'!$1:$1048576,MATCH(BS!$B9,'BS 2015'!$A:$A,0),MATCH(BS!D$4,'BS 2015'!$1:$1,0))","v":46.9},{"$f":"INDEX('BS 2016'!$1:$1048576,MATCH(BS!$B9,'BS 2016'!$A:$A,0),MATCH(BS!E$4,'BS 2016'!$1:$1,0))","v":68},{"$f":"F22*'P&L'!J$6","v":55.601476457602764},{"$f":"G22*'P&L'!K$6","v":56.713505986754825},{"$f":"H22*'P&L'!L$6","v":57.847776106489917},{"$f":"I22*'P&L'!M$6","v":59.004731628619716},{"$f":"J22*'P&L'!N$6","v":60.184826261192114}]
[null,"Assets",{"$f":"SUM(C5:C9)","v":932.09999999999991},{"$f":"SUM(D5:D9)","v":947.99999999999989},1226.8,{"$f":"SUM(F5:F9)","v":1328.184488573437},{"$f":"SUM(G5:G9)","v":1423.8806517912756},{"$f":"SUM(H5:H9)","v":1520.3489360048534},{"$f":"SUM(I5:I9)","v":1617.4374716909922},{"$f":"SUM(J5:J9)","v":1714.9763286220482}]
[]
[null,"Trade Payables",{"$f":"OFFSET('BS 2014'!$A$1,MATCH(BS!B12,'BS 2014'!$A:$A,0)-1,MATCH(BS!C$4,'BS 2014'!$1:$1,0)-1)","v":68},{"$f":"INDEX('BS 2015'!$1:$1048576,MATCH(BS!$B12,'BS 2015'!$A:$A,0),MATCH(BS!D$4,'BS 2015'!$1:$1,0))","v":68.900000000000006},{"$f":"INDEX('BS 2016'!$1:$1048576,MATCH(BS!$B12,'BS 2016'!$A:$A,0),MATCH(BS!E$4,'BS 2016'!$1:$1,0))","v":68.900000000000006},{"$f":"-F20*'P&L'!J$7/360","v":71.374282557921575},{"$f":"-G20*'P&L'!K$7/360","v":72.801768209080009},{"$f":"-H20*'P&L'!L$7/360","v":74.257803573261597},{"$f":"-I20*'P&L'!M$7/360","v":75.742959644726838},{"$f":"-J20*'P&L'!N$7/360","v":77.257818837621386}]
[null,"Provisions",{"$f":"OFFSET('BS 2014'!$A$1,MATCH(BS!B13,'BS 2014'!$A:$A,0)-1,MATCH(BS!C$4,'BS 2014'!$1:$1,0)-1)","v":32.5},{"$f":"INDEX('BS 2015'!$1:$1048576,MATCH(BS!$B13,'BS 2015'!$A:$A,0),MATCH(BS!D$4,'BS 2015'!$1:$1,0))","v":28.699999999999996},{"$f":"INDEX('BS 2016'!$1:$1048576,MATCH(BS!$B13,'BS 2016'!$A:$A,0),MATCH(BS!E$4,'BS 2016'!$1:$1,0))","v":28.699999999999996},{"$f":"$E$13","v":28.699999999999996},{"$f":"$E$13","v":28.699999999999996},28.699999999999996,28.699999999999996,28.699999999999996,"flat provisions"]
[null,"Financial Liabilities",{"$f":"OFFSET('BS 2014'!$A$1,MATCH(BS!B14,'BS 2014'!$A:$A,0)-1,MATCH(BS!C$4,'BS 2014'!$1:$1,0)-1)","v":615.79999999999995},{"$f":"INDEX('BS 2015'!$1:$1048576,MATCH(BS!$B14,'BS 2015'!$A:$A,0),MATCH(BS!D$4,'BS 2015'!$1:$1,0))","v":610.4},{"$f":"INDEX('BS 2016'!$1:$1048576,MATCH(BS!$B14,'BS 2016'!$A:$A,0),MATCH(BS!E$4,'BS 2016'!$1:$1,0))","v":605},{"$f":"'Financial Liabilities'!F8","v":565.17884560503455},{"$f":"'Financial Liabilities'!G8","v":521.77378731452222},{"$f":"'Financial Liabilities'!H8","v":474.4622737778638},{"$f":"'Financial Liabilities'!I8","v":422.89272402290612},{"$f":"'Financial Liabilities'!J8","v":366.68191479000222},"Financial Liabilities"]
[null,"Other liabilities",{"$f":"OFFSET('BS 2014'!$A$1,MATCH(BS!B15,'BS 2014'!$A:$A,0)-1,MATCH(BS!C$4,'BS 2014'!$1:$1,0)-1)","v":48.3},{"$f":"INDEX('BS 2015'!$1:$1048576,MATCH(BS!$B15,'BS 2015'!$A:$A,0),MATCH(BS!D$4,'BS 2015'!$1:$1,0))","v":43.3},{"$f":"INDEX('BS 2016'!$1:$1048576,MATCH(BS!$B15,'BS 2016'!$A:$A,0),MATCH(BS!E$4,'BS 2016'!$1:$1,0))","v":38.9},{"$f":"F23*'P&L'!J$6","v":45.309458720293307},{"$f":"G23*'P&L'!K$6","v":46.215647894699174},{"$f":"H23*'P&L'!L$6","v":47.139960852593163},{"$f":"I23*'P&L'!M$6","v":48.082760069645026},{"$f":"J23*'P&L'!N$6","v":49.044415271037927}]
{"$rows_left_out":13}
{"sheet":"FA Roll Forward PPE","index":8,"n_rows":11,"n_cols":10,"rows_kept":11,"cut":false,"hidden":false,"merged":[[2,5,2,9]]}
[null,"Fixed Asset Roll Forward"]
[]
[null,null,null,null,null,"Forecast"]
[null,"$ in MM","2014-12-31","2015-12-31","2016-12-31","2017-12-31","2018-12-31","2019-12-31","2020-12-31","2021-12-31"]
[null,"Beginning PP&E",null,{"$f":"BS!C7","v":632.5},{"$f":"BS!D7","v":632.5},{"$f":"E8","v":659.5},{"$f":"F8","v":673.57628458498027},687.95301160774272,702.6365936736787,717.63358025801801]
[null,"D&A",null,{"$f":"'P&L'!D11","v":-44},{"$f":"'P&L'!E11","v":-41},{"$f":"F$5*F10","v":-44.314229249011859},{"$f":"G$5*G10","v":-45.260066553140966},-46.22609168905781,-47.212735543290663,-48.22043819915536]
[null,"Capex",null,{"$f":"D8-D6-D5","v":44},{"$f":"E8-E6-E5","v":68},{"$f":"F$5*F11","v":58.390513833992095},59.63679357590339,60.909673754993825,62.209722127630052,63.537518568298829]
[null,"Ending PP&E",{"$f":"SUM(C5:C7)","v":0},{"$f":"BS!D7","v":632.5},{"$f":"BS!E7","v":659.5},{"$f":"SUM(F5:F7)","v":673.57628458498027},687.95301160774272,702.6365936736787,717.63358025801801,732.95066062716148]
[]
[null,"D&A as % of Beg PP&E",null,{"$f":"D6/D$5","v":-6.9565217391304349E-2},{"$f":"E6/E$5","v":-6.4822134387351779E-2},{"$f":"AVERAGE($D10:$E10)","v":-6.7193675889328064E-2},{"$f":"AVERAGE($D10:$E10)","v":-6.7193675889328064E-2},-6.7193675889328064E-2,-6.7193675889328064E-2,-6.7193675889328064E-2]
[null,"Capex as % of Beg PP&E",null,{"$f":"D7/D$5","v":6.9565217391304349E-2},{"$f":"E7/E$5","v":0.10750988142292491},{"$f":"AVERAGE($D11:$E11)","v":8.8537549407114627E-2},8.8537549407114627E-2,8.8537549407114627E-2,8.8537549407114627E-2,8.8537549407114627E-2]

{"sheet":"Financial Liabilities","index":9,"n_rows":19,"n_cols":12,"rows_kept":19,"cut":false,"hidden":false,"merged":[[2,5,2,9]]}
[null,"Financial Liabilities"]
[]
[null,null,null,null,null,"Forecast"]
[null,"$ in MM","2014-12-31","2015-12-31","2016-12-31","2017-12-31","2018-12-31","2019-12-31","2020-12-31","2021-12-31"]
[null,"Beginning Debt",null,{"$f":"C8","v":615.79999999999995},{"$f":"D8","v":610.4},{"$f":"E8","v":605},565.17884560503455,521.77378731452222,474.4622737778638,422.89272402290612]
[null,"New Debt",null,0,0,0,0,0,0,0]
[null,"Principal Repayments",null,{"$f":"D8-D5","v":-5.3999999999999773},{"$f":"E8-E5","v":-5.3999999999999773},{"$f":"C18","v":-39.82115439496544},{"$f":"D18","v":-43.405058290512336},-47.311513536658445,-51.569549754957698,-56.210809232903898]
[null,"Ending Debt",{"$f":"BS!C14","v":615.79999999999995},{"$f":"BS!D14","v":610.4},{"$f":"BS!E14","v":605},{"$f":"F5+F7","v":565.17884560503455},{"$f":"G5+G7","v":521.77378731452222},474.4622737778638,422.89272402290612,366.68191479000222]
[]
[null,"Debt to be repaid (in years)",10]
[null,"I/R",0.09]
[null,"Annual Payment",{"$f":"PMT(C11,C10,E8)","v":-94.271154394965436}]
[]
[]
["Period",null,1,2,3,4,5,6,7,8,9,10]
{"$rows_left_out":5}
{"sheet":"Equity Schedule","index":10,"n_rows":11,"n_cols":10,"rows_kept":11,"cut":false,"hidden":false,"merged":[[2,5,2,9]]}
[null,"Equity Schedule"]
[]
[null,null,null,null,null,"Forecast"]
[null,"$ in MM","2014-12-31","2015-12-31","2016-12-31","2017-12-31","2018-12-31","2019-12-31","2020-12-31","2021-12-31"]
[null,"Beginning Equity",null,null,null,{"$f":"E9","v":485.3},{"$f":"F9","v":617.62190169018731},754.38944837297379,895.78889780113457,1042.0190279537139]
[null,"Increase of Capital",null,null,null,0,0,0,0,0]
[null,"Net Income (Loss)",null,null,null,{"$f":"'P&L'!J16","v":220.53650281697901},{"$f":"'P&L'!K16","v":227.94591113797736},{"$f":"'P&L'!L16","v":235.66574904693474},{"$f":"'P&L'!M16","v":243.71688358763225},{"$f":"'P&L'!N16","v":252.12191961612064}]
[null,"Dividends",null,null,null,{"$f":"IF(F7>0,-F7*F11,\"0\")","v":-88.214601126791607},{"$f":"IF(G7>0,-G7*G11,\"0\")","v":-91.178364455190945},-94.2662996187739,-97.486753435052904,-100.84876784644825]
[null,"Ending Equity",{"$f":"SUM(C5:C8)","v":0},null,{"$f":"BS!E16","v":485.3},{"$f":"SUM(F5:F8)","v":617.62190169018731},{"$f":"SUM(G5:G8)","v":754.38944837297379},895.78889780113457,1042.0190279537139,1193.2921797233864]
[]
[null,"Dividends as % of NI",null,null,null,0.4,0.4,0.4,0.4,0.4]

{"sheet":"Cash Flow","index":11,"n_rows":19,"n_cols":7,"rows_kept":19,"cut":false,"hidden":false,"merged":[]}
[null,"Cash Flow"]
[]
[null,null,null,null,"Forecast"]
[null,"$ in MM",2017,2018,2019,2020,2021]
[null,"EBITDA",{"$f":"'P&L'!J10","v":438.05115665974881},{"$f":"'P&L'!K10","v":446.81217979294388},{"$f":"'P&L'!L10","v":455.74842338880285},{"$f":"'P&L'!M10","v":464.8633918565788},{"$f":"'P&L'!N10","v":474.16065969371016}]
[null,"Interest Expenses",{"$f":"'P&L'!J13","v":-54.449999999999996},{"$f":"'P&L'!K13","v":-50.866096104453099},{"$f":"'P&L'!L13","v":-46.959640858306997},{"$f":"'P&L'!M13","v":-42.701604640007737},{"$f":"'P&L'!N13","v":-38.060345162061552}]
[null,"Taxes",{"$f":"'P&L'!J15","v":-118.75042459375793},{"$f":"'P&L'!K15","v":-122.74010599737242},{"$f":"'P&L'!L15","v":-126.89694179450331},{"$f":"'P&L'!M15","v":-131.23216808564814},{"$f":"'P&L'!N15","v":-135.75795671637263}]
[null,"Change in Trade Receivables",{"$f":"-(BS!F5-BS!E5)","v":7.2164748042491738},{"$f":"-(BS!G5-BS!F5)","v":-3.2416705039150031},{"$f":"-(BS!H5-BS!G5)","v":-3.3065039139933106},{"$f":"-(BS!I5-BS!H5)","v":-3.3726339922731938},{"$f":"-(BS!J5-BS!I5)","v":-3.4400866721186389}]
[null,"Change in Inventory",{"$f":"-(BS!F6-BS!E6)","v":10.364117805224453},{"$f":"-(BS!G6-BS!F6)","v":-1.9927176438955172},{"$f":"-(BS!H6-BS!G6)","v":-2.0325719967734273},{"$f":"-(BS!I6-BS!H6)","v":-2.0732234367089006},{"$f":"-(BS!J6-BS!I6)","v":-2.1146879054430769}]
[null,"Change in Trade Payables",{"$f":"BS!F12-BS!E12","v":2.474282557921569},{"$f":"BS!G12-BS!F12","v":1.4274856511584346},{"$f":"BS!H12-BS!G12","v":1.456035364181588},{"$f":"BS!I12-BS!H12","v":1.4851560714652408},{"$f":"BS!J12-BS!I12","v":1.5148591928945478}]
[null,"Change in Other Assets",{"$f":"-(BS!F9-BS!E9)","v":12.398523542397236},{"$f":"-(BS!G9-BS!F9)","v":-1.1120295291520605},{"$f":"-(BS!H9-BS!G9)","v":-1.134270119735092},{"$f":"-(BS!I9-BS!H9)","v":-1.1569555221297989},{"$f":"-(BS!J9-BS!I9)","v":-1.1800946325723984}]
[null,"Change in Other Liabilities",{"$f":"BS!F15-BS!E15","v":6.4094587202933084},{"$f":"BS!G15-BS!F15","v":0.90618917440586699},{"$f":"BS!H15-BS!G15","v":0.9243129578939886},{"$f":"BS!I15-BS!H15","v":0.94279921705186354},{"$f":"BS!J15-BS!I15","v":0.96165520139290095}]
[null,"Capex",{"$f":"-'FA Roll Forward PPE'!F7","v":-58.390513833992095},{"$f":"-'FA Roll Forward PPE'!G7","v":-59.63679357590339},{"$f":"-'FA Roll Forward PPE'!H7","v":-60.909673754993825},{"$f":"-'FA Roll Forward PPE'!I7","v":-62.209722127630052},{"$f":"-'FA Roll Forward PPE'!J7","v":-63.537518568298829}]
[null,"Operation Cash Flow",{"$f":"SUM(C5:C13)","v":245.32307566208453},{"$f":"SUM(D5:D13)","v":209.55644126381671},216.88916927257253,224.54503934069803,232.54648443113052]
[null,"Dividends",{"$f":"'Equity Schedule'!F8","v":-88.214601126791607},{"$f":"'Equity Schedule'!G8","v":-91.178364455190945},{"$f":"'Equity Schedule'!H8","v":-94.2662996187739},{"$f":"'Equity Schedule'!I8","v":-97.486753435052904},{"$f":"'Equity Schedule'!J8","v":-100.84876784644825}]
{"$rows_left_out":4}